{"text_format":"1","workbook":"xlsx","n_sheets":3,"sheets":["Calendrier_annuel","Calendrier_paysage","Calendrier_portrait"],"not_rendered":{"charts":0,"images":6,"macros":1,"external_links":0,"defined_names":29,"comments":0,"pivot_tables":0},"unopened":[],"bounds":{"document_bytes":16777216,"sheet_cells":100000,"rows_first":2000,"rows_last":500,"rows_between":2000,"halvings":0,"cell_chars":16384,"cell_head_chars":4096},"cells_cut":0,"cells_raw":0,"read":"whole","date_system":"1900"}

{"sheet":"Calendrier_annuel","index":0,"n_rows":23,"n_cols":13,"rows_kept":23,"cut":false,"hidden":false,"merged":[[22,1,22,3],[22,5,22,9],[22,12,22,14],[3,8,3,13],[1,2,1,6],[8,2,8,4],[9,2,9,4],[3,2,3,4],[4,2,4,4],[5,2,5,4],[6,2,6,4],[7,2,7,4]]}
[]
[null,null,"Créateur de Calendrier annuel ( v. 2.2 )"]
[]
[null,null,"Type de calendrier",null,null,"Horizontal (paysage)",null,null,"Aperçu de votre Calendrier"]
[null,null,"Début de Calendrier - Année:",null,null,2018]
[null,null,"Début de Calendrier - Mois:",null,null,1]
[null,null,"Fin de Calendrier (Mois / Année):",null,null,{"$f":"CalendrierFin(DebutCalendrierAnnee,DebutCalendrierMois)","v":"12/2018"}]
[null,null,"Titre personnalisé de Calendrier:"]
[null,null,"Indiquer les jours fériés?",null,null,"OUI"]
[null,null,{"$f":"IF(F9=\"OUI\",\"Jours fériés du pays:\",\" \")","v":"Jours fériés du pays:"},null,null,"France"]
[]
[]
[null,null,null,"2) Couleurs\n(cellule + police)",null,"3) Export & Impression"]
[null,null,null,"Titre du Mois impair"]
[null,null,null,"Titre du Mois pair"]
[null,null,null,"Cases des Jours ouvrables"]
[null,null,null,"Cases des Jours fériés"]
[null,null,null,"Cases des Samedis"]
[null,null,null,"Cases des Dimanches"]
[null,null,null,"Le Fond du Calendrier",null,"Satisfaits avec le calendrier?\nVous pouvez alors…"]
[]
[]
[null,"©  Excel-Malin.com",null,null,null,"http://excel-malin.com",null,null,null,null,null,null,"contact@excel-malin.com"]

{"sheet":"Calendrier_paysage","index":1,"n_rows":37,"n_cols":36,"rows_kept":37,"cut":false,"hidden":true,"merged":[[1,1,2,37],[4,2,4,3],[4,35,4,36],[4,32,4,33],[4,29,4,30],[4,26,4,27],[4,23,4,24],[4,20,4,21],[4,17,4,18],[4,14,4,15],[4,5,4,6],[4,8,4,9],[4,11,4,12]]}
[]
[null,{"$f":"IF(TitreDeCalendrier<>\"\",TitreDeCalendrier,\"Calendrier \" & DebutCalendrierMois & \"/\" & AnneeCalendrier & \" - \" & FinDeCalendrier)","v":"Calendrier 1/2018 - 12/2018"}]
[]
[]
[null,null,{"$f":"NomMois(DebutCalendrierMois)","v":"Janvier"},null,null,{"$f":"NomMois(IF(DebutCalendrierMois+1<13,DebutCalendrierMois+1,DebutCalendrierMois+1-12))","v":"Février"},null,null,{"$f":"NomMois(IF(DebutCalendrierMois+2<13,DebutCalendrierMois+2,DebutCalendrierMois+2-12))","v":"Mars"},null,null,{"$f":"NomMois(IF(DebutCalendrierMois+3<13,DebutCalendrierMois+3,DebutCalendrierMois+3-12))","v":"Avril"},null,null,{"$f":"NomMois(IF(DebutCalendrierMois+4<13,DebutCalendrierMois+4,DebutCalendrierMois+4-12))","v":"Mai"},null,null,{"$f":"NomMois(IF(DebutCalendrierMois+5<13,DebutCalendrierMois+5,DebutCalendrierMois+5-12))","v":"Juin"},null,null,{"$f":"NomMois(IF(DebutCalendrierMois+6<13,DebutCalendrierMois+6,DebutCalendrierMois+6-12))","v":"Juillet"},null,null,{"$f":"NomMois(IF(DebutCalendrierMois+7<13,DebutCalendrierMois+7,DebutCalendrierMois+7-12))","v":"Août"},null,null,{"$f":"NomMois(IF(DebutCalendrierMois+8<13,DebutCalendrierMois+8,DebutCalendrierMois+8-12))","v":"Septembre"},null,null,{"$f":"NomMois(IF(DebutCalendrierMois+9<13,DebutCalendrierMois+9,DebutCalendrierMois+9-12))","v":"Octobre"},null,null,{"$f":"NomMois(IF(DebutCalendrierMois+10<13,DebutCalendrierMois+10,DebutCalendrierMois+10-12))","v":"Novembre"},null,null,{"$f":"NomMois(IF(DebutCalendrierMois+11<13,DebutCalendrierMois+11,DebutCalendrierMois+11-12))","v":"Décembre"}]
[]
[null,null,{"$f":"DATE(AnneeCalendrier,DebutCalendrierMois,1)","v":"2018-01-01"},null,null,{"$f":"DebutMoisSuivant(C7)","v":"2018-02-01"},null,null,{"$f":"DebutMoisSuivant(F7)","v":"2018-03-01"},null,null,{"$f":"DebutMoisSuivant(I7)","v":"2018-04-01"},null,null,{"$f":"DebutMoisSuivant(L7)","v":"2018-05-01"},null,null,{"$f":"DebutMoisSuivant(O7)","v":"2018-06-01"},null,null,{"$f":"DebutMoisSuivant(R7)","v":"2018-07-01"},null,null,{"$f":"DebutMoisSuivant(U7)","v":"2018-08-01"},null,null,{"$f":"DebutMoisSuivant(X7)","v":"2018-09-01"},null,null,{"$f":"DebutMoisSuivant(AA7)","v":"2018-10-01"},null,null,{"$f":"DebutMoisSuivant(AD7)","v":"2018-11-01"},null,null,{"$f":"DebutMoisSuivant(AG7)","v":"2018-12-01"}]
[null,null,{"$f":"C7+1","v":"2018-01-02"},null,null,{"$f":"F7+1","v":"2018-02-02"},null,null,{"$f":"I7+1","v":"2018-03-02"},null,null,{"$f":"L7+1","v":"2018-04-02"},null,null,{"$f":"O7+1","v":"2018-05-02"},null,null,{"$f":"R7+1","v":"2018-06-02"},null,null,{"$f":"U7+1","v":"2018-07-02"},null,null,{"$f":"X7+1","v":"2018-08-02"},null,null,{"$f":"AA7+1","v":"2018-09-02"},null,null,{"$f":"AD7+1","v":"2018-10-02"},null,null,{"$f":"AG7+1","v":"2018-11-02"},null,null,{"$f":"AJ7+1","v":"2018-12-02"}]
[null,null,{"$f":"C8+1","v":"2018-01-03"},null,null,{"$f":"F8+1","v":"2018-02-03"},null,null,{"$f":"I8+1","v":"2018-03-03"},null,null,{"$f":"L8+1","v":"2018-04-03"},null,null,{"$f":"O8+1","v":"2018-05-03"},null,null,{"$f":"R8+1","v":"2018-06-03"},null,null,{"$f":"U8+1","v":"2018-07-03"},null,null,{"$f":"X8+1","v":"2018-08-03"},null,null,{"$f":"AA8+1","v":"2018-09-03"},null,null,{"$f":"AD8+1","v":"2018-10-03"},null,null,{"$f":"AG8+1","v":"2018-11-03"},null,null,{"$f":"AJ8+1","v":"2018-12-03"}]
[null,null,"2018-01-04",null,null,"2018-02-04",null,null,"2018-03-04",null,null,"2018-04-04",null,null,"2018-05-04",null,null,"2018-06-04",null,null,"2018-07-04",null,null,"2018-08-04",null,null,"2018-09-04",null,null,"2018-10-04",null,null,"2018-11-04",null,null,"2018-12-04"]
[null,null,"2018-01-05",null,null,"2018-02-05",null,null,"2018-03-05",null,null,"2018-04-05",null,null,"2018-05-05",null,null,"2018-06-05",null,null,"2018-07-05",null,null,"2018-08-05",null,null,"2018-09-05",null,null,"2018-10-05",null,null,"2018-11-05",null,null,"2018-12-05"]
[null,null,"2018-01-06",null,null,"2018-02-06",null,null,"2018-03-06",null,null,"2018-04-06",null,null,"2018-05-06",null,null,"2018-06-06",null,null,"2018-07-06",null,null,"2018-08-06",null,null,"2018-09-06",null,null,"2018-10-06",null,null,"2018-11-06",null,null,"2018-12-06"]
[null,null,"2018-01-07",null,null,"2018-02-07",null,null,"2018-03-07",null,null,"2018-04-07",null,null,"2018-05-07",null,null,"2018-06-07",null,null,"2018-07-07",null,null,"2018-08-07",null,null,"2018-09-07",null,null,"2018-10-07",null,null,"2018-11-07",null,null,"2018-12-07"]
[null,null,"2018-01-08",null,null,"2018-02-08",null,null,"2018-03-08",null,null,"2018-04-08",null,null,"2018-05-08",null,null,"2018-06-08",null,null,"2018-07-08",null,null,"2018-08-08",null,null,"2018-09-08",null,null,"2018-10-08",null,null,"2018-11-08",null,null,"2018-12-08"]
[null,null,"2018-01-09",null,null,"2018-02-09",null,null,"2018-03-09",null,null,"2018-04-09",null,null,"2018-05-09",null,null,"2018-06-09",null,null,"2018-07-09",null,null,"2018-08-09",null,null,"2018-09-09",null,null,"2018-10-09",null,null,"2018-11-09",null,null,"2018-12-09"]
[null,null,"2018-01-10",null,null,"2018-02-10",null,null,"2018-03-10",null,null,"2018-04-10",null,null,"2018-05-10",null,null,"2018-06-10",null,null,"2018-07-10",null,null,"2018-08-10",null,null,"2018-09-10",null,null,"2018-10-10",null,null,"2018-11-10",null,null,"2018-12-10"]
[null,null,"2018-01-11",null,null,"2018-02-11",null,null,"2018-03-11",null,null,"2018-04-11",null,null,"2018-05-11",null,null,"2018-06-11",null,null,"2018-07-11",null,null,"2018-08-11",null,null,"2018-09-11",null,null,"2018-10-11",null,null,"2018-11-11",null,null,"2018-12-11"]
[null,null,"2018-01-12",null,null,"2018-02-12",null,null,"2018-03-12",null,null,"2018-04-12",null,null,"2018-05-12",null,null,"2018-06-12",null,null,"2018-07-12",null,null,"2018-08-12",null,null,"2018-09-12",null,null,"2018-10-12",null,null,"2018-11-12",null,null,"2018-12-12"]
[null,null,"2018-01-13",null,null,"2018-02-13",null,null,"2018-03-13",null,null,"2018-04-13",null,null,"2018-05-13",null,null,"2018-06-13",null,null,"2018-07-13",null,null,"2018-08-13",null,null,"2018-09-13",null,null,"2018-10-13",null,null,"2018-11-13",null,null,"2018-12-13"]
[null,null,"2018-01-14",null,null,"2018-02-14",null,null,"2018-03-14",null,null,"2018-04-14",null,null,"2018-05-14",null,null,"2018-06-14",null,null,"2018-07-14",null,null,"2018-08-14",null,null,"2018-09-14",null,null,"2018-10-14",null,null,"2018-11-14",null,null,"2018-12-14"]
[null,null,"2018-01-15",null,null,"2018-02-15",null,null,"2018-03-15",null,null,"2018-04-15",null,null,"2018-05-15",null,null,"2018-06-15",null,null,"2018-07-15",null,null,"2018-08-15",null,null,"2018-09-15",null,null,"2018-10-15",null,null,"2018-11-15",null,null,"2018-12-15"]
[null,null,"2018-01-16",null,null,"2018-02-16",null,null,"2018-03-16",null,null,"2018-04-16",null,null,"2018-05-16",null,null,"2018-06-16",null,null,"2018-07-16",null,null,"2018-08-16",null,null,"2018-09-16",null,null,"2018-10-16",null,null,"2018-11-16",null,null,"2018-12-16"]
[null,null,"2018-01-17",null,null,"2018-02-17",null,null,"2018-03-17",null,null,"2018-04-17",null,null,"2018-05-17",null,null,"2018-06-17",null,null,"2018-07-17",null,null,"2018-08-17",null,null,"2018-09-17",null,null,"2018-10-17",null,null,"2018-11-17",null,null,"2018-12-17"]
[null,null,"2018-01-18",null,null,"2018-02-18",null,null,"2018-03-18",null,null,"2018-04-18",null,null,"2018-05-18",null,null,"2018-06-18",null,null,"2018-07-18",null,null,"2018-08-18",null,null,"2018-09-18",null,null,"2018-10-18",null,null,"2018-11-18",null,null,"2018-12-18"]
[null,null,"2018-01-19",null,null,"2018-02-19",null,null,"2018-03-19",null,null,"2018-04-19",null,null,"2018-05-19",null,null,"2018-06-19",null,null,"2018-07-19",null,null,"2018-08-19",null,null,"2018-09-19",null,null,"2018-10-19",null,null,"2018-11-19",null,null,"2018-12-19"]
[null,null,"2018-01-20",null,null,"2018-02-20",null,null,"2018-03-20",null,null,"2018-04-20",null,null,"2018-05-20",null,null,"2018-06-20",null,null,"2018-07-20",null,null,"2018-08-20",null,null,"2018-09-20",null,null,"2018-10-20",null,null,"2018-11-20",null,null,"2018-12-20"]
[null,null,"2018-01-21",null,null,"2018-02-21",null,null,"2018-03-21",null,null,"2018-04-21",null,null,"2018-05-21",null,null,"2018-06-21",null,null,"2018-07-21",null,null,"2018-08-21",null,null,"2018-09-21",null,null,"2018-10-21",null,null,"2018-11-21",null,null,"2018-12-21"]
[null,null,"2018-01-22",null,null,"2018-02-22",null,null,"2018-03-22",null,null,"2018-04-22",null,null,"2018-05-22",null,null,"2018-06-22",null,null,"2018-07-22",null,null,"2018-08-22",null,null,"2018-09-22",null,null,"2018-10-22",null,null,"2018-11-22",null,null,"2018-12-22"]
[null,null,"2018-01-23",null,null,"2018-02-23",null,null,"2018-03-23",null,null,"2018-04-23",null,null,"2018-05-23",null,null,"2018-06-23",null,null,"2018-07-23",null,null,"2018-08-23",null,null,"2018-09-23",null,null,"2018-10-23",null,null,"2018-11-23",null,null,"2018-12-23"]
[null,null,"2018-01-24",null,null,"2018-02-24",null,null,"2018-03-24",null,null,"2018-04-24",null,null,"2018-05-24",null,null,"2018-06-24",null,null,"2018-07-24",null,null,"2018-08-24",null,null,"2018-09-24",null,null,"2018-10-24",null,null,"2018-11-24",null,null,"2018-12-24"]
[null,null,"2018-01-25",null,null,"2018-02-25",null,null,"2018-03-25",null,null,"2018-04-25",null,null,"2018-05-25",null,null,"2018-06-25",null,null,"2018-07-25",null,null,"2018-08-25",null,null,"2018-09-25",null,null,"2018-10-25",null,null,"2018-11-25",null,null,"2018-12-25"]
[null,null,"2018-01-26",null,null,"2018-02-26",null,null,"2018-03-26",null,null,"2018-04-26",null,null,"2018-05-26",null,null,"2018-06-26",null,null,"2018-07-26",null,null,"2018-08-26",null,null,"2018-09-26",null,null,"2018-10-26",null,null,"2018-11-26",null,null,"2018-12-26"]
[null,null,"2018-01-27",null,null,"2018-02-27",null,null,"2018-03-27",null,null,"2018-04-27",null,null,"2018-05-27",null,null,"2018-06-27",null,null,"2018-07-27",null,null,"2018-08-27",null,null,"2018-09-27",null,null,"2018-10-27",null,null,"2018-11-27",null,null,"2018-12-27"]
[null,null,"2018-01-28",null,null,"2018-02-28",null,null,"2018-03-28",null,null,"2018-04-28",null,null,"2018-05-28",null,null,"2018-06-28",null,null,"2018-07-28",null,null,"2018-08-28",null,null,"2018-09-28",null,null,"2018-10-28",null,null,"2018-11-28",null,null,"2018-12-28"]
[null,null,{"$f":"IFERROR(IF(MONTH(C34)<>MONTH(C34+1),\"\",C34+1),\"\")","v":"2018-01-29"},null,null,{"$f":"IFERROR(IF(MONTH(F34)<>MONTH(F34+1),\"\",F34+1),\"\")","v":""},null,null,{"$f":"IFERROR(IF(MONTH(I34)<>MONTH(I34+1),\"\",I34+1),\"\")","v":"2018-03-29"},null,null,{"$f":"IFERROR(IF(MONTH(L34)<>MONTH(L34+1),\"\",L34+1),\"\")","v":"2018-04-29"},null,null,{"$f":"IFERROR(IF(MONTH(O34)<>MONTH(O34+1),\"\",O34+1),\"\")","v":"2018-05-29"},null,null,{"$f":"IFERROR(IF(MONTH(R34)<>MONTH(R34+1),\"\",R34+1),\"\")","v":"2018-06-29"},null,null,{"$f":"IFERROR(IF(MONTH(U34)<>MONTH(U34+1),\"\",U34+1),\"\")","v":"2018-07-29"},null,null,{"$f":"IFERROR(IF(MONTH(X34)<>MONTH(X34+1),\"\",X34+1),\"\")","v":"2018-08-29"},null,null,{"$f":"IFERROR(IF(MONTH(AA34)<>MONTH(AA34+1),\"\",AA34+1),\"\")","v":"2018-09-29"},null,null,{"$f":"IFERROR(IF(MONTH(AD34)<>MONTH(AD34+1),\"\",AD34+1),\"\")","v":"2018-10-29"},null,null,{"$f":"IFERROR(IF(MONTH(AG34)<>MONTH(AG34+1),\"\",AG34+1),\"\")","v":"2018-11-29"},null,null,{"$f":"IFERROR(IF(MONTH(AJ34)<>MONTH(AJ34+1),\"\",AJ34+1),\"\")","v":"2018-12-29"}]
[null,null,{"$f":"IFERROR(IF(MONTH(C35)<>MONTH(C35+1),\"\",C35+1),\"\")","v":"2018-01-30"},null,null,{"$f":"IFERROR(IF(MONTH(F35)<>MONTH(F35+1),\"\",F35+1),\"\")","v":""},null,null,{"$f":"IFERROR(IF(MONTH(I35)<>MONTH(I35+1),\"\",I35+1),\"\")","v":"2018-03-30"},null,null,{"$f":"IFERROR(IF(MONTH(L35)<>MONTH(L35+1),\"\",L35+1),\"\")","v":"2018-04-30"},null,null,{"$f":"IFERROR(IF(MONTH(O35)<>MONTH(O35+1),\"\",O35+1),\"\")","v":"2018-05-30"},null,null,{"$f":"IFERROR(IF(MONTH(R35)<>MONTH(R35+1),\"\",R35+1),\"\")","v":"2018-06-30"},null,null,{"$f":"IFERROR(IF(MONTH(U35)<>MONTH(U35+1),\"\",U35+1),\"\")","v":"2018-07-30"},null,null,{"$f":"IFERROR(IF(MONTH(X35)<>MONTH(X35+1),\"\",X35+1),\"\")","v":"2018-08-30"},null,null,{"$f":"IFERROR(IF(MONTH(AA35)<>MONTH(AA35+1),\"\",AA35+1),\"\")","v":"2018-09-30"},null,null,{"$f":"IFERROR(IF(MONTH(AD35)<>MONTH(AD35+1),\"\",AD35+1),\"\")","v":"2018-10-30"},null,null,{"$f":"IFERROR(IF(MONTH(AG35)<>MONTH(AG35+1),\"\",AG35+1),\"\")","v":"2018-11-30"},null,null,{"$f":"IFERROR(IF(MONTH(AJ35)<>MONTH(AJ35+1),\"\",AJ35+1),\"\")","v":"2018-12-30"}]
[null,null,"2018-01-31",null,null,"",null,null,"2018-03-31",null,null,"",null,null,"2018-05-31",null,null,"",null,null,"2018-07-31",null,null,"2018-08-31",null,null,"",null,null,"2018-10-31",null,null,"",null,null,"2018-12-31"]

{"sheet":"Calendrier_portrait","index":2,"n_rows":67,"n_cols":25,"rows_kept":67,"cut":false,"hidden":true,"merged":[[1,1,2,25]]}
[]
[null,{"$f":"Calendrier_paysage!B2","v":"Calendrier 1/2018 - 12/2018"}]
[]
[]
[null,null,{"$f":"Calendrier_paysage!C5","v":"Janvier"},null,{"$f":"Calendrier_paysage!F5","v":"Février"},null,{"$f":"Calendrier_paysage!I5","v":"Mars"},null,{"$f":"Calendrier_paysage!L5","v":"Avril"},null,{"$f":"Calendrier_paysage!O5","v":"Mai"},null,{"$f":"Calendrier_paysage!R5","v":"Juin"},null,{"$f":"Calendrier_paysage!U5","v":"Juillet"},null,{"$f":"Calendrier_paysage!X5","v":"Août"},null,{"$f":"Calendrier_paysage!AA5","v":"Septembre"},null,{"$f":"Calendrier_paysage!AD5","v":"Octobre"},null,{"$f":"Calendrier_paysage!AG5","v":"Novembre"},null,{"$f":"Calendrier_paysage!AJ5","v":"Décembre"}]
[]
[null,null,{"$f":"Calendrier_paysage!C7","v":"2018-01-01"},null,{"$f":"Calendrier_paysage!F7","v":"2018-02-01"},null,{"$f":"Calendrier_paysage!I7","v":"2018-03-01"},null,{"$f":"Calendrier_paysage!L7","v":"2018-04-01"},null,{"$f":"Calendrier_paysage!O7","v":"2018-05-01"},null,{"$f":"Calendrier_paysage!R7","v":"2018-06-01"},null,{"$f":"Calendrier_paysage!U7","v":"2018-07-01"},null,{"$f":"Calendrier_paysage!X7","v":"2018-08-01"},null,{"$f":"Calendrier_paysage!AA7","v":"2018-09-01"},null,{"$f":"Calendrier_paysage!AD7","v":"2018-10-01"},null,{"$f":"Calendrier_paysage!AG7","v":"2018-11-01"},null,{"$f":"Calendrier_paysage!AJ7","v":"2018-12-01"}]
[]
[null,null,{"$f":"C7+1","v":"2018-01-02"},null,{"$f":"E7+1","v":"2018-02-02"},null,{"$f":"G7+1","v":"2018-03-02"},null,{"$f":"I7+1","v":"2018-04-02"},null,{"$f":"K7+1","v":"2018-05-02"},null,{"$f":"M7+1","v":"2018-06-02"},null,{"$f":"O7+1","v":"2018-07-02"},null,{"$f":"Q7+1","v":"2018-08-02"},null,{"$f":"S7+1","v":"2018-09-02"},null,{"$f":"U7+1","v":"2018-10-02"},null,{"$f":"W7+1","v":"2018-11-02"},null,{"$f":"Y7+1","v":"2018-12-02"}]
[]
[null,null,{"$f":"C9+1","v":"2018-01-03"},null,{"$f":"E9+1","v":"2018-02-03"},null,{"$f":"G9+1","v":"2018-03-03"},null,{"$f":"I9+1","v":"2018-04-03"},null,{"$f":"K9+1","v":"2018-05-03"},null,{"$f":"M9+1","v":"2018-06-03"},null,{"$f":"O9+1","v":"2018-07-03"},null,{"$f":"Q9+1","v":"2018-08-03"},null,{"$f":"S9+1","v":"2018-09-03"},null,{"$f":"U9+1","v":"2018-10-03"},null,{"$f":"W9+1","v":"2018-11-03"},null,{"$f":"Y9+1","v":"2018-12-03"}]
[]
[null,null,{"$f":"C11+1","v":"2018-01-04"},null,{"$f":"E11+1","v":"2018-02-04"},null,{"$f":"G11+1","v":"2018-03-04"},null,{"$f":"I11+1","v":"2018-04-04"},null,{"$f":"K11+1","v":"2018-05-04"},null,{"$f":"M11+1","v":"2018-06-04"},null,{"$f":"O11+1","v":"2018-07-04"},null,{"$f":"Q11+1","v":"2018-08-04"},null,{"$f":"S11+1","v":"2018-09-04"},null,{"$f":"U11+1","v":"2018-10-04"},null,{"$f":"W11+1","v":"2018-11-04"},null,{"$f":"Y11+1","v":"2018-12-04"}]
[]
[null,null,{"$f":"C13+1","v":"2018-01-05"},null,{"$f":"E13+1","v":"2018-02-05"},null,{"$f":"G13+1","v":"2018-03-05"},null,{"$f":"I13+1","v":"2018-04-05"},null,{"$f":"K13+1","v":"2018-05-05"},null,{"$f":"M13+1","v":"2018-06-05"},null,{"$f":"O13+1","v":"2018-07-05"},null,{"$f":"Q13+1","v":"2018-08-05"},null,{"$f":"S13+1","v":"2018-09-05"},null,{"$f":"U13+1","v":"2018-10-05"},null,{"$f":"W13+1","v":"2018-11-05"},null,{"$f":"Y13+1","v":"2018-12-05"}]
[]
[null,null,{"$f":"C15+1","v":"2018-01-06"},null,{"$f":"E15+1","v":"2018-02-06"},null,{"$f":"G15+1","v":"2018-03-06"},null,{"$f":"I15+1","v":"2018-04-06"},null,{"$f":"K15+1","v":"2018-05-06"},null,{"$f":"M15+1","v":"2018-06-06"},null,{"$f":"O15+1","v":"2018-07-06"},null,{"$f":"Q15+1","v":"2018-08-06"},null,{"$f":"S15+1","v":"2018-09-06"},null,{"$f":"U15+1","v":"2018-10-06"},null,{"$f":"W15+1","v":"2018-11-06"},null,{"$f":"Y15+1","v":"2018-12-06"}]
[]
[null,null,{"$f":"C17+1","v":"2018-01-07"},null,{"$f":"E17+1","v":"2018-02-07"},null,{"$f":"G17+1","v":"2018-03-07"},null,{"$f":"I17+1","v":"2018-04-07"},null,{"$f":"K17+1","v":"2018-05-07"},null,{"$f":"M17+1","v":"2018-06-07"},null,{"$f":"O17+1","v":"2018-07-07"},null,{"$f":"Q17+1","v":"2018-08-07"},null,{"$f":"S17+1","v":"2018-09-07"},null,{"$f":"U17+1","v":"2018-10-07"},null,{"$f":"W17+1","v":"2018-11-07"},null,{"$f":"Y17+1","v":"2018-12-07"}]
[]
[null,null,{"$f":"C19+1","v":"2018-01-08"},null,{"$f":"E19+1","v":"2018-02-08"},null,{"$f":"G19+1","v":"2018-03-08"},null,{"$f":"I19+1","v":"2018-04-08"},null,{"$f":"K19+1","v":"2018-05-08"},null,{"$f":"M19+1","v":"2018-06-08"},null,{"$f":"O19+1","v":"2018-07-08"},null,{"$f":"Q19+1","v":"2018-08-08"},null,{"$f":"S19+1","v":"2018-09-08"},null,{"$f":"U19+1","v":"2018-10-08"},null,{"$f":"W19+1","v":"2018-11-08"},null,{"$f":"Y19+1","v":"2018-12-08"}]
[]
[null,null,{"$f":"C21+1","v":"2018-01-09"},null,{"$f":"E21+1","v":"2018-02-09"},null,{"$f":"G21+1","v":"2018-03-09"},null,{"$f":"I21+1","v":"2018-04-09"},null,{"$f":"K21+1","v":"2018-05-09"},null,{"$f":"M21+1","v":"2018-06-09"},null,{"$f":"O21+1","v":"2018-07-09"},null,{"$f":"Q21+1","v":"2018-08-09"},null,{"$f":"S21+1","v":"2018-09-09"},null,{"$f":"U21+1","v":"2018-10-09"},null,{"$f":"W21+1","v":"2018-11-09"},null,{"$f":"Y21+1","v":"2018-12-09"}]
[]
[null,null,{"$f":"C23+1","v":"2018-01-10"},null,{"$f":"E23+1","v":"2018-02-10"},null,{"$f":"G23+1","v":"2018-03-10"},null,{"$f":"I23+1","v":"2018-04-10"},null,{"$f":"K23+1","v":"2018-05-10"},null,{"$f":"M23+1","v":"2018-06-10"},null,{"$f":"O23+1","v":"2018-07-10"},null,{"$f":"Q23+1","v":"2018-08-10"},null,{"$f":"S23+1","v":"2018-09-10"},null,{"$f":"U23+1","v":"2018-10-10"},null,{"$f":"W23+1","v":"2018-11-10"},null,{"$f":"Y23+1","v":"2018-12-10"}]
[]
[null,null,{"$f":"C25+1","v":"2018-01-11"},null,{"$f":"E25+1","v":"2018-02-11"},null,{"$f":"G25+1","v":"2018-03-11"},null,{"$f":"I25+1","v":"2018-04-11"},null,{"$f":"K25+1","v":"2018-05-11"},null,{"$f":"M25+1","v":"2018-06-11"},null,{"$f":"O25+1","v":"2018-07-11"},null,{"$f":"Q25+1","v":"2018-08-11"},null,{"$f":"S25+1","v":"2018-09-11"},null,{"$f":"U25+1","v":"2018-10-11"},null,{"$f":"W25+1","v":"2018-11-11"},null,{"$f":"Y25+1","v":"2018-12-11"}]
[]
[null,null,{"$f":"C27+1","v":"2018-01-12"},null,{"$f":"E27+1","v":"2018-02-12"},null,{"$f":"G27+1","v":"2018-03-12"},null,{"$f":"I27+1","v":"2018-04-12"},null,{"$f":"K27+1","v":"2018-05-12"},null,{"$f":"M27+1","v":"2018-06-12"},null,{"$f":"O27+1","v":"2018-07-12"},null,{"$f":"Q27+1","v":"2018-08-12"},null,{"$f":"S27+1","v":"2018-09-12"},null,{"$f":"U27+1","v":"2018-10-12"},null,{"$f":"W27+1","v":"2018-11-12"},null,{"$f":"Y27+1","v":"2018-12-12"}]
[]
[null,null,{"$f":"C29+1","v":"2018-01-13"},null,{"$f":"E29+1","v":"2018-02-13"},null,{"$f":"G29+1","v":"2018-03-13"},null,{"$f":"I29+1","v":"2018-04-13"},null,{"$f":"K29+1","v":"2018-05-13"},null,{"$f":"M29+1","v":"2018-06-13"},null,{"$f":"O29+1","v":"2018-07-13"},null,{"$f":"Q29+1","v":"2018-08-13"},null,{"$f":"S29+1","v":"2018-09-13"},null,{"$f":"U29+1","v":"2018-10-13"},null,{"$f":"W29+1","v":"2018-11-13"},null,{"$f":"Y29+1","v":"2018-12-13"}]
[]
[null,null,{"$f":"C31+1","v":"2018-01-14"},null,{"$f":"E31+1","v":"2018-02-14"},null,{"$f":"G31+1","v":"2018-03-14"},null,{"$f":"I31+1","v":"2018-04-14"},null,{"$f":"K31+1","v":"2018-05-14"},null,{"$f":"M31+1","v":"2018-06-14"},null,{"$f":"O31+1","v":"2018-07-14"},null,{"$f":"Q31+1","v":"2018-08-14"},null,{"$f":"S31+1","v":"2018-09-14"},null,{"$f":"U31+1","v":"2018-10-14"},null,{"$f":"W31+1","v":"2018-11-14"},null,{"$f":"Y31+1","v":"2018-12-14"}]
[]
[null,null,{"$f":"C33+1","v":"2018-01-15"},null,{"$f":"E33+1","v":"2018-02-15"},null,{"$f":"G33+1","v":"2018-03-15"},null,{"$f":"I33+1","v":"2018-04-15"},null,{"$f":"K33+1","v":"2018-05-15"},null,{"$f":"M33+1","v":"2018-06-15"},null,{"$f":"O33+1","v":"2018-07-15"},null,{"$f":"Q33+1","v":"2018-08-15"},null,{"$f":"S33+1","v":"2018-09-15"},null,{"$f":"U33+1","v":"2018-10-15"},null,{"$f":"W33+1","v":"2018-11-15"},null,{"$f":"Y33+1","v":"2018-12-15"}]
[]
[null,null,{"$f":"C35+1","v":"2018-01-16"},null,{"$f":"E35+1","v":"2018-02-16"},null,{"$f":"G35+1","v":"2018-03-16"},null,{"$f":"I35+1","v":"2018-04-16"},null,{"$f":"K35+1","v":"2018-05-16"},null,{"$f":"M35+1","v":"2018-06-16"},null,{"$f":"O35+1","v":"2018-07-16"},null,{"$f":"Q35+1","v":"2018-08-16"},null,{"$f":"S35+1","v":"2018-09-16"},null,{"$f":"U35+1","v":"2018-10-16"},null,{"$f":"W35+1","v":"2018-11-16"},null,{"$f":"Y35+1","v":"2018-12-16"}]
[]
[null,null,{"$f":"C37+1","v":"2018-01-17"},null,{"$f":"E37+1","v":"2018-02-17"},null,{"$f":"G37+1","v":"2018-03-17"},null,{"$f":"I37+1","v":"2018-04-17"},null,{"$f":"K37+1","v":"2018-05-17"},null,{"$f":"M37+1","v":"2018-06-17"},null,{"$f":"O37+1","v":"2018-07-17"},null,{"$f":"Q37+1","v":"2018-08-17"},null,{"$f":"S37+1","v":"2018-09-17"},null,{"$f":"U37+1","v":"2018-10-17"},null,{"$f":"W37+1","v":"2018-11-17"},null,{"$f":"Y37+1","v":"2018-12-17"}]
[]
[null,null,{"$f":"C39+1","v":"2018-01-18"},null,{"$f":"E39+1","v":"2018-02-18"},null,{"$f":"G39+1","v":"2018-03-18"},null,{"$f":"I39+1","v":"2018-04-18"},null,{"$f":"K39+1","v":"2018-05-18"},null,{"$f":"M39+1","v":"2018-06-18"},null,{"$f":"O39+1","v":"2018-07-18"},null,{"$f":"Q39+1","v":"2018-08-18"},null,{"$f":"S39+1","v":"2018-09-18"},null,{"$f":"U39+1","v":"2018-10-18"},null,{"$f":"W39+1","v":"2018-11-18"},null,{"$f":"Y39+1","v":"2018-12-18"}]
[]
[null,null,{"$f":"C41+1","v":"2018-01-19"},null,{"$f":"E41+1","v":"2018-02-19"},null,{"$f":"G41+1","v":"2018-03-19"},null,{"$f":"I41+1","v":"2018-04-19"},null,{"$f":"K41+1","v":"2018-05-19"},null,{"$f":"M41+1","v":"2018-06-19"},null,{"$f":"O41+1","v":"2018-07-19"},null,{"$f":"Q41+1","v":"2018-08-19"},null,{"$f":"S41+1","v":"2018-09-19"},null,{"$f":"U41+1","v":"2018-10-19"},null,{"$f":"W41+1","v":"2018-11-19"},null,{"$f":"Y41+1","v":"2018-12-19"}]
[]
[null,null,{"$f":"C43+1","v":"2018-01-20"},null,{"$f":"E43+1","v":"2018-02-20"},null,{"$f":"G43+1","v":"2018-03-20"},null,{"$f":"I43+1","v":"2018-04-20"},null,{"$f":"K43+1","v":"2018-05-20"},null,{"$f":"M43+1","v":"2018-06-20"},null,{"$f":"O43+1","v":"2018-07-20"},null,{"$f":"Q43+1","v":"2018-08-20"},null,{"$f":"S43+1","v":"2018-09-20"},null,{"$f":"U43+1","v":"2018-10-20"},null,{"$f":"W43+1","v":"2018-11-20"},null,{"$f":"Y43+1","v":"2018-12-20"}]
[]
[null,null,{"$f":"C45+1","v":"2018-01-21"},null,{"$f":"E45+1","v":"2018-02-21"},null,{"$f":"G45+1","v":"2018-03-21"},null,{"$f":"I45+1","v":"2018-04-21"},null,{"$f":"K45+1","v":"2018-05-21"},null,{"$f":"M45+1","v":"2018-06-21"},null,{"$f":"O45+1","v":"2018-07-21"},null,{"$f":"Q45+1","v":"2018-08-21"},null,{"$f":"S45+1","v":"2018-09-21"},null,{"$f":"U45+1","v":"2018-10-21"},null,{"$f":"W45+1","v":"2018-11-21"},null,{"$f":"Y45+1","v":"2018-12-21"}]
[]
[null,null,{"$f":"C47+1","v":"2018-01-22"},null,{"$f":"E47+1","v":"2018-02-22"},null,{"$f":"G47+1","v":"2018-03-22"},null,{"$f":"I47+1","v":"2018-04-22"},null,{"$f":"K47+1","v":"2018-05-22"},null,{"$f":"M47+1","v":"2018-06-22"},null,{"$f":"O47+1","v":"2018-07-22"},null,{"$f":"Q47+1","v":"2018-08-22"},null,{"$f":"S47+1","v":"2018-09-22"},null,{"$f":"U47+1","v":"2018-10-22"},null,{"$f":"W47+1","v":"2018-11-22"},null,{"$f":"Y47+1","v":"2018-12-22"}]
[]
[null,null,{"$f":"C49+1","v":"2018-01-23"},null,{"$f":"E49+1","v":"2018-02-23"},null,{"$f":"G49+1","v":"2018-03-23"},null,{"$f":"I49+1","v":"2018-04-23"},null,{"$f":"K49+1","v":"2018-05-23"},null,{"$f":"M49+1","v":"2018-06-23"},null,{"$f":"O49+1","v":"2018-07-23"},null,{"$f":"Q49+1","v":"2018-08-23"},null,{"$f":"S49+1","v":"2018-09-23"},null,{"$f":"U49+1","v":"2018-10-23"},null,{"$f":"W49+1","v":"2018-11-23"},null,{"$f":"Y49+1","v":"2018-12-23"}]
[]
[null,null,{"$f":"C51+1","v":"2018-01-24"},null,{"$f":"E51+1","v":"2018-02-24"},null,{"$f":"G51+1","v":"2018-03-24"},null,{"$f":"I51+1","v":"2018-04-24"},null,{"$f":"K51+1","v":"2018-05-24"},null,{"$f":"M51+1","v":"2018-06-24"},null,{"$f":"O51+1","v":"2018-07-24"},null,{"$f":"Q51+1","v":"2018-08-24"},null,{"$f":"S51+1","v":"2018-09-24"},null,{"$f":"U51+1","v":"2018-10-24"},null,{"$f":"W51+1","v":"2018-11-24"},null,{"$f":"Y51+1","v":"2018-12-24"}]
[]
[null,null,{"$f":"C53+1","v":"2018-01-25"},null,{"$f":"E53+1","v":"2018-02-25"},null,{"$f":"G53+1","v":"2018-03-25"},null,{"$f":"I53+1","v":"2018-04-25"},null,{"$f":"K53+1","v":"2018-05-25"},null,{"$f":"M53+1","v":"2018-06-25"},null,{"$f":"O53+1","v":"2018-07-25"},null,{"$f":"Q53+1","v":"2018-08-25"},null,{"$f":"S53+1","v":"2018-09-25"},null,{"$f":"U53+1","v":"2018-10-25"},null,{"$f":"W53+1","v":"2018-11-25"},null,{"$f":"Y53+1","v":"2018-12-25"}]
[]
[null,null,{"$f":"C55+1","v":"2018-01-26"},null,{"$f":"E55+1","v":"2018-02-26"},null,{"$f":"G55+1","v":"2018-03-26"},null,{"$f":"I55+1","v":"2018-04-26"},null,{"$f":"K55+1","v":"2018-05-26"},null,{"$f":"M55+1","v":"2018-06-26"},null,{"$f":"O55+1","v":"2018-07-26"},null,{"$f":"Q55+1","v":"2018-08-26"},null,{"$f":"S55+1","v":"2018-09-26"},null,{"$f":"U55+1","v":"2018-10-26"},null,{"$f":"W55+1","v":"2018-11-26"},null,{"$f":"Y55+1","v":"2018-12-26"}]
[]
[null,null,{"$f":"C57+1","v":"2018-01-27"},null,{"$f":"E57+1","v":"2018-02-27"},null,{"$f":"G57+1","v":"2018-03-27"},null,{"$f":"I57+1","v":"2018-04-27"},null,{"$f":"K57+1","v":"2018-05-27"},null,{"$f":"M57+1","v":"2018-06-27"},null,{"$f":"O57+1","v":"2018-07-27"},null,{"$f":"Q57+1","v":"2018-08-27"},null,{"$f":"S57+1","v":"2018-09-27"},null,{"$f":"U57+1","v":"2018-10-27"},null,{"$f":"W57+1","v":"2018-11-27"},null,{"$f":"Y57+1","v":"2018-12-27"}]
[]
[null,null,{"$f":"C59+1","v":"2018-01-28"},null,{"$f":"E59+1","v":"2018-02-28"},null,{"$f":"G59+1","v":"2018-03-28"},null,{"$f":"I59+1","v":"2018-04-28"},null,{"$f":"K59+1","v":"2018-05-28"},null,{"$f":"M59+1","v":"2018-06-28"},null,{"$f":"O59+1","v":"2018-07-28"},null,{"$f":"Q59+1","v":"2018-08-28"},null,{"$f":"S59+1","v":"2018-09-28"},null,{"$f":"U59+1","v":"2018-10-28"},null,{"$f":"W59+1","v":"2018-11-28"},null,{"$f":"Y59+1","v":"2018-12-28"}]
[]
[null,null,{"$f":"IFERROR(IF(MONTH(C61)<>MONTH(C61+1),\"\",C61+1),\"\")","v":"2018-01-29"},null,{"$f":"IFERROR(IF(MONTH(E61)<>MONTH(E61+1),\"\",E61+1),\"\")","v":""},null,{"$f":"IFERROR(IF(MONTH(G61)<>MONTH(G61+1),\"\",G61+1),\"\")","v":"2018-03-29"},null,{"$f":"IFERROR(IF(MONTH(I61)<>MONTH(I61+1),\"\",I61+1),\"\")","v":"2018-04-29"},null,{"$f":"IFERROR(IF(MONTH(K61)<>MONTH(K61+1),\"\",K61+1),\"\")","v":"2018-05-29"},null,{"$f":"IFERROR(IF(MONTH(M61)<>MONTH(M61+1),\"\",M61+1),\"\")","v":"2018-06-29"},null,{"$f":"IFERROR(IF(MONTH(O61)<>MONTH(O61+1),\"\",O61+1),\"\")","v":"2018-07-29"},null,{"$f":"IFERROR(IF(MONTH(Q61)<>MONTH(Q61+1),\"\",Q61+1),\"\")","v":"2018-08-29"},null,{"$f":"IFERROR(IF(MONTH(S61)<>MONTH(S61+1),\"\",S61+1),\"\")","v":"2018-09-29"},null,{"$f":"IFERROR(IF(MONTH(U61)<>MONTH(U61+1),\"\",U61+1),\"\")","v":"2018-10-29"},null,{"$f":"IFERROR(IF(MONTH(W61)<>MONTH(W61+1),\"\",W61+1),\"\")","v":"2018-11-29"},null,{"$f":"IFERROR(IF(MONTH(Y61)<>MONTH(Y61+1),\"\",Y61+1),\"\")","v":"2018-12-29"}]
[]
[null,null,{"$f":"IFERROR(IF(MONTH(C63)<>MONTH(C63+1),\"\",C63+1),\"\")","v":"2018-01-30"},null,{"$f":"IFERROR(IF(MONTH(E63)<>MONTH(E63+1),\"\",E63+1),\"\")","v":""},null,{"$f":"IFERROR(IF(MONTH(G63)<>MONTH(G63+1),\"\",G63+1),\"\")","v":"2018-03-30"},null,{"$f":"IFERROR(IF(MONTH(I63)<>MONTH(I63+1),\"\",I63+1),\"\")","v":"2018-04-30"},null,{"$f":"IFERROR(IF(MONTH(K63)<>MONTH(K63+1),\"\",K63+1),\"\")","v":"2018-05-30"},null,{"$f":"IFERROR(IF(MONTH(M63)<>MONTH(M63+1),\"\",M63+1),\"\")","v":"2018-06-30"},null,{"$f":"IFERROR(IF(MONTH(O63)<>MONTH(O63+1),\"\",O63+1),\"\")","v":"2018-07-30"},null,{"$f":"IFERROR(IF(MONTH(Q63)<>MONTH(Q63+1),\"\",Q63+1),\"\")","v":"2018-08-30"},null,{"$f":"IFERROR(IF(MONTH(S63)<>MONTH(S63+1),\"\",S63+1),\"\")","v":"2018-09-30"},null,{"$f":"IFERROR(IF(MONTH(U63)<>MONTH(U63+1),\"\",U63+1),\"\")","v":"2018-10-30"},null,{"$f":"IFERROR(IF(MONTH(W63)<>MONTH(W63+1),\"\",W63+1),\"\")","v":"2018-11-30"},null,{"$f":"IFERROR(IF(MONTH(Y63)<>MONTH(Y63+1),\"\",Y63+1),\"\")","v":"2018-12-30"}]
[]
[null,null,{"$f":"IFERROR(IF(MONTH(C65)<>MONTH(C65+1),\"\",C65+1),\"\")","v":"2018-01-31"},null,{"$f":"IFERROR(IF(MONTH(E65)<>MONTH(E65+1),\"\",E65+1),\"\")","v":""},null,{"$f":"IFERROR(IF(MONTH(G65)<>MONTH(G65+1),\"\",G65+1),\"\")","v":"2018-03-31"},null,{"$f":"IFERROR(IF(MONTH(I65)<>MONTH(I65+1),\"\",I65+1),\"\")","v":""},null,{"$f":"IFERROR(IF(MONTH(K65)<>MONTH(K65+1),\"\",K65+1),\"\")","v":"2018-05-31"},null,{"$f":"IFERROR(IF(MONTH(M65)<>MONTH(M65+1),\"\",M65+1),\"\")","v":""},null,{"$f":"IFERROR(IF(MONTH(O65)<>MONTH(O65+1),\"\",O65+1),\"\")","v":"2018-07-31"},null,{"$f":"IFERROR(IF(MONTH(Q65)<>MONTH(Q65+1),\"\",Q65+1),\"\")","v":"2018-08-31"},null,{"$f":"IFERROR(IF(MONTH(S65)<>MONTH(S65+1),\"\",S65+1),\"\")","v":""},null,{"$f":"IFERROR(IF(MONTH(U65)<>MONTH(U65+1),\"\",U65+1),\"\")","v":"2018-10-31"},null,{"$f":"IFERROR(IF(MONTH(W65)<>MONTH(W65+1),\"\",W65+1),\"\")","v":""},null,{"$f":"IFERROR(IF(MONTH(Y65)<>MONTH(Y65+1),\"\",Y65+1),\"\")","v":"2018-12-31"}]